Target
Integrin-linked protein kinase
Ligand
BDBM124028
Substrate
Meas. Tech.
In Vitro Ezyme Assay
Temperature
313.15±n/a K
IC50
100±n/a nM
Comments
extracted
Citation
 Zhang, ZDaynard, TSWang, SDu, XChopiuk, GBYan, JChen, JSviridov, SV Pyrazolylbenzothiazole derivatives and their use as therapeutic agents US Patent  US8754233 Publication Date 6/17/2014 
Target
Name:
Integrin-linked protein kinase
Synonyms:
ILK ILK2 Integrin-linked protein kinase (ILK) | Serine/threonine-protein kinase ILK-1
Type:
Protein
Mol. Mass.:
51429.75
Organism:
Homo sapiens (Human)
Description:
Q13418
Residue:
452
  
Inhibitor
Name:
BDBM124028
Synonyms:
US8754233, 4-Benzothiazol-2-yl-5-furan-2-yl-2H-pyrazol-3-ylamine
Type:
Small organic molecule
Emp. Form.:
C14H10N4OS
Mol. Mass.:
282.32
SMILES:
Nc1[nH]nc(-c2ccco2)c1-c1nc2ccccc2s1
: