Target
Proto-oncogene tyrosine-protein kinase receptor Ret [658-1114]
Ligand
BDBM284043
Substrate
Meas. Tech.
RET Enzyme Assay
pH
7.4±n/a
IC50
4.40±n/a nM
Comments
extracted
Citation
 Andrews, SWBlake, JFChicarelli, MJGolos, AHaas, JJiang, YKolakowski, GR Substituted pyrazolo[1,5-A]pyridine compounds as RET kinase inhibitors US Patent  US10023570 Publication Date 7/17/2018 
Target
Name:
Proto-oncogene tyrosine-protein kinase receptor Ret [658-1114]
Synonyms:
CDHF12 PTC Proto-oncogene tyrosine-protein kinase receptor Ret (aa 658-1114) RET Kinase (aa 658-1114) RET_HUMAN
Type:
Mol. Mass.:
51535.16
Organism:
Homo sapiens (Human)
Description:
P07949[658-1114]
Residue:
457
  
Inhibitor
Name:
BDBM284043
Synonyms:
US10023570, Example 53 | US10174027, Example 53
Type:
Small organic molecule
Emp. Form.:
C27H30N8O2
Mol. Mass.:
498.5795
SMILES:
CC(C)C[C@@H](O)C(=O)N1CCN(CC1)c1ccc(cn1)-c1cc(cn2ncc(C#N)c12)-c1cnn(C)c1
: