Target
Proto-oncogene tyrosine-protein kinase receptor Ret [658-1114]
Ligand
BDBM284117
Substrate
Meas. Tech.
RET Enzyme Assay
pH
7.4±n/a
IC50
2.70±n/a nM
Comments
extracted
Citation
 Andrews, SWBlake, JFChicarelli, MJGolos, AHaas, JJiang, YKolakowski, GR Substituted pyrazolo[1,5-A]pyridine compounds as RET kinase inhibitors US Patent  US10023570 Publication Date 7/17/2018 
Target
Name:
Proto-oncogene tyrosine-protein kinase receptor Ret [658-1114]
Synonyms:
CDHF12 PTC Proto-oncogene tyrosine-protein kinase receptor Ret (aa 658-1114) RET Kinase (aa 658-1114) RET_HUMAN
Type:
Mol. Mass.:
51535.16
Organism:
Homo sapiens (Human)
Description:
P07949[658-1114]
Residue:
457
  
Inhibitor
Name:
BDBM284117
Synonyms:
US10023570, Example 127 | US10174027, Example 127
Type:
Small organic molecule
Emp. Form.:
C28H25N9O
Mol. Mass.:
503.5578
SMILES:
Cn1cc(cn1)-c1cc(-c2ccc(nc2)N2CCN(CC2)C(=O)Nc2ccccc2)c2c(cnn2c1)C#N
: