Target
Proto-oncogene tyrosine-protein kinase receptor Ret [658-1114]
Ligand
BDBM284567
Substrate
Meas. Tech.
RET Enzyme Assay
pH
7.4±n/a
IC50
5.20±n/a nM
Comments
extracted
Citation
 Andrews, SWBlake, JFChicarelli, MJGolos, AHaas, JJiang, YKolakowski, GR Substituted pyrazolo[1,5-A]pyridine compounds as RET kinase inhibitors US Patent  US10023570 Publication Date 7/17/2018 
Target
Name:
Proto-oncogene tyrosine-protein kinase receptor Ret [658-1114]
Synonyms:
CDHF12 PTC Proto-oncogene tyrosine-protein kinase receptor Ret (aa 658-1114) RET Kinase (aa 658-1114) RET_HUMAN
Type:
Mol. Mass.:
51535.16
Organism:
Homo sapiens (Human)
Description:
P07949[658-1114]
Residue:
457
  
Inhibitor
Name:
BDBM284567
Synonyms:
US10023570, Example 586 | US10174027, Example 586
Type:
Small organic molecule
Emp. Form.:
C27H23F2N9
Mol. Mass.:
511.5286
SMILES:
FC(F)n1cc(cn1)-c1cc(-c2ccc(nc2)N2CCN(Cc3ccccn3)CC2)c2c(cnn2c1)C#N
: