Target
Beta-secretase 1
Ligand
BDBM50432608
Substrate
Meas. Tech.
Inhibition Assay
Temperature
310.15±n/a K
IC50
1±n/a nM
Comments
extracted
Citation
 Hilpert, HWostl, W 1,3-oxazines as BACE1 and/or BACE2 inhibitors US Patent  US8754075 Publication Date 6/17/2014 
Target
Name:
Beta-secretase 1
Synonyms:
ASP2 Aspartyl protease 2 BACE1 Beta-secretase (BACE) Beta-secretase 1 (BACE 1) Beta-secretase 1 (BACE1) Beta-site amyloid precursor protein cleaving enzyme 1 Memapsin-2 beta-Secretase (BACE-1) | beta-Secretase (BACE1)
Type:
Protein
Mol. Mass.:
55755.10
Organism:
Homo sapiens (Human)
Description:
P56817
Residue:
501
  
Inhibitor
Name:
BDBM50432608
Synonyms:
CHEMBL2347204 | US8754075, 4
Type:
Small organic molecule
Emp. Form.:
C18H15F2N5O2
Mol. Mass.:
371.3408
SMILES:
C[C@@]1(N=C(N)OC[C@@H]1F)c1cc(NC(=O)c2ccc(cn2)C#N)ccc1F
: