Target
Beta-secretase 2
Ligand
BDBM124168
Substrate
Meas. Tech.
Inhibition Assay
Temperature
310.15±n/a K
IC50
4±n/a nM
Comments
extracted
Citation
 Hilpert, HWostl, W 1,3-oxazines as BACE1 and/or BACE2 inhibitors US Patent  US8754075 Publication Date 6/17/2014 
Target
Name:
Beta-secretase 2
Synonyms:
AEPLC ASP1 Asp 1 Aspartyl protease 1 BACE2_HUMAN Beta-secretase (BACE) Beta-secretase 2 (BACE-2) Beta-site APP-cleaving enzyme 2 Memapsin-1 beta-Secretase (BACE-2)
Type:
Protein
Mol. Mass.:
56171.20
Organism:
Homo sapiens (Human)
Description:
Q9Y5Z0
Residue:
518
  
Inhibitor
Name:
BDBM124168
Synonyms:
US8754075, 39
Type:
Small organic molecule
Emp. Form.:
C18H16Cl2F2N4O2
Mol. Mass.:
429.248
SMILES:
C[C@]1(F)COC(N)=N[C@]1(C)c1cc(NC(=O)c2ncc(Cl)cc2Cl)ccc1F
: