Target
cGMP-dependent 3',5'-cyclic phosphodiesterase
Ligand
BDBM284739
Substrate
Meas. Tech.
Phosphodiesterase (PDE) 2A and 10 Assay
Temperature
298.15±n/a K
IC50
12.0±n/a nM
Comments
extracted
Citation
 Hoenke, CBertani, BFerrara, MFossati, GFrattini, SGiovannini, RHobson, S Cyclic ether derivatives of pyrazolo[1,5-a]pyrimidine-3-carboxyamide US Patent  US10023575 Publication Date 7/17/2018 
Target
Name:
cGMP-dependent 3',5'-cyclic phosphodiesterase
Synonyms:
CGS-PDE Homo sapiens phosphodiesterase 2A (PDE2A) PDE2A cGSPDE
Type:
Enzyme Catalytic Domain
Mol. Mass.:
105691.58
Organism:
Homo sapiens (Human)
Description:
O00408
Residue:
941
  
Inhibitor
Name:
BDBM284739
Synonyms:
US10023575, Example 30 US10875867, Example 30 | US11691977, Example 30
Type:
Small organic molecule
Emp. Form.:
C22H20F4N4O2
Mol. Mass.:
448.4134
SMILES:
Fc1cc(ccc1C1(CCCOC1)NC(=O)c1cnn2cc(cnc12)C1CC1)C(F)(F)F
: