Target
cGMP-dependent 3',5'-cyclic phosphodiesterase
Ligand
BDBM284760
Substrate
Meas. Tech.
Phosphodiesterase (PDE) 2A and 10 Assay
Temperature
298.15±n/a K
IC50
59.0±n/a nM
Comments
extracted
Citation
 Hoenke, CBertani, BFerrara, MFossati, GFrattini, SGiovannini, RHobson, S Cyclic ether derivatives of pyrazolo[1,5-a]pyrimidine-3-carboxyamide US Patent  US10023575 Publication Date 7/17/2018 
Target
Name:
cGMP-dependent 3',5'-cyclic phosphodiesterase
Synonyms:
CGS-PDE Homo sapiens phosphodiesterase 2A (PDE2A) PDE2A cGSPDE
Type:
Enzyme Catalytic Domain
Mol. Mass.:
105691.58
Organism:
Homo sapiens (Human)
Description:
O00408
Residue:
941
  
Inhibitor
Name:
BDBM284760
Synonyms:
BDBM284800 US10479794, Example 88b US11691977, Example 51
Type:
Small organic molecule
Emp. Form.:
C22H22F3N5O3
Mol. Mass.:
461.437
SMILES:
Cc1nn2cc(cnc2c1C(=O)NC1(CCOCC1O)c1ccc(nc1)C(F)(F)F)C1CC1
: