Target
Tyrosine-protein phosphatase non-receptor type 6
Ligand
BDBM124249
Substrate
Meas. Tech.
pNPP assay
IC50
1.776e+4± 2.35e+3 nM
Citation
 Wang, WLHuang, CGao, LXTang, CLWang, JQWu, MCSheng, LChen, HJNan, FJLi, JYLi, JFeng, B Synthesis and biological evaluation of novel bis-aromatic amides as novel PTP1B inhibitors. Bioorg Med Chem Lett 24:1889-94 (2014)  
Target
Name:
Tyrosine-protein phosphatase non-receptor type 6
Synonyms:
HCP PTP1C Protein tyrosine phosphatase SHP-1 (SHP-1) Protein-tyrosine phosphatase SHP-1 Tyrosine-protein phosphatase non-receptor type 6 | Tyrosine-protein phosphatase non-receptor type 6 (SHP1)
Type:
Protein
Mol. Mass.:
67570.41
Organism:
Homo sapiens (Human)
Description:
P29350
Residue:
595
  
Inhibitor
Name:
BDBM124249
Synonyms:
4-fluoro-N-(6-(4-(4-fluorobenzamido)phenyl)pyridin-3-yl)benzamide (29)
Type:
Small organic molecule
Emp. Form.:
C25H17F2N3O2
Mol. Mass.:
429.4182
SMILES:
Fc1ccc(cc1)C(=O)Nc1ccc(cc1)-c1ccc(NC(=O)c2ccc(F)cc2)cn1
: