Target
Cholesteryl ester transfer protein
Ligand
BDBM124876
Substrate
Meas. Tech.
In Vitro Assay
pH
7.4±n/a
Temperature
310.15±n/a K
IC50
32±n/a nM
Citation
 Mogi, MKawanami, TYamada, KYasoshima, KImase, HMiyake, TOhmori, O Organic compounds US Patent  US8759365 Publication Date 6/24/2014 
Target
Name:
Cholesteryl ester transfer protein
Synonyms:
CETP Cholesteryl ester transfer protein (CETP) | Lipid transfer protein I
Type:
Enzyme
Mol. Mass.:
54751.53
Organism:
Homo sapiens (Human)
Description:
P11597
Residue:
493
  
Inhibitor
Name:
BDBM124876
Synonyms:
US8759365, 17
Type:
Small organic molecule
Emp. Form.:
C28H31F6N7O2
Mol. Mass.:
611.5819
SMILES:
CC[C@@H]1C[C@@H](CN1C(=O)N1CCOCC1)N(Cc1cc(cc(c1)C(F)(F)F)C(F)(F)F)c1ncc(cn1)-c1cnn(C)c1
: