Target
Leucyl-cystinyl aminopeptidase
Ligand
BDBM284935
Substrate
Meas. Tech.
Inhibition of Human P-LAP (hP-LAP) Activity
IC50
7.00±n/a nM
Citation
 Kawaguchi, KIshihata, AKanai, AInagaki, YHiramoto, MEnjo, KTakamatsu, H Bicyclic pyridine compound US Patent  US10023583 Publication Date 7/17/2018 
Target
Name:
Leucyl-cystinyl aminopeptidase
Synonyms:
Aminopeptidase Cystinyl aminopeptidase Insulin-regulated membrane aminopeptidase LCAP_HUMAN Leucyl-cystinyl aminopeptidase, pregnancy serum form Oxytocinase Placental leucine aminopeptidase
Type:
PROTEIN
Mol. Mass.:
117334.10
Organism:
Homo sapiens (Human)
Description:
ChEMBL_1473494
Residue:
1025
  
Inhibitor
Name:
BDBM284935
Synonyms:
US10023583, Example 7(2)
Type:
Small organic molecule
Emp. Form.:
C18H25ClN2O4S
Mol. Mass.:
400.92
SMILES:
CCC(Cl)CCc1cc2c(C[C@@](O)([C@@H](N)CSC)C(O)=O)nccc2o1
: