Target
Leucyl-cystinyl aminopeptidase
Ligand
BDBM284939
Substrate
Meas. Tech.
Inhibition of Human P-LAP (hP-LAP) Activity
IC50
3.60±n/a nM
Citation
 Kawaguchi, KIshihata, AKanai, AInagaki, YHiramoto, MEnjo, KTakamatsu, H Bicyclic pyridine compound US Patent  US10023583 Publication Date 7/17/2018 
Target
Name:
Leucyl-cystinyl aminopeptidase
Synonyms:
Aminopeptidase Cystinyl aminopeptidase Insulin-regulated membrane aminopeptidase LCAP_HUMAN Leucyl-cystinyl aminopeptidase, pregnancy serum form Oxytocinase Placental leucine aminopeptidase
Type:
PROTEIN
Mol. Mass.:
117334.10
Organism:
Homo sapiens (Human)
Description:
ChEMBL_1473494
Residue:
1025
  
Inhibitor
Name:
BDBM284939
Synonyms:
US10023583, Example 11
Type:
Small organic molecule
Emp. Form.:
C22H30N2O4S
Mol. Mass.:
418.55
SMILES:
N[C@@H](CSCC1CCC1)[C@](O)(Cc1nccc2oc(CCC3CC3)cc12)C(O)=O
: