Target
Leucyl-cystinyl aminopeptidase
Ligand
BDBM284940
Substrate
Meas. Tech.
Inhibition of IRAP Activity
IC50
5.70±n/a nM
Citation
 Kawaguchi, KIshihata, AKanai, AInagaki, YHiramoto, MEnjo, KTakamatsu, H Bicyclic pyridine compound US Patent  US10023583 Publication Date 7/17/2018 
Target
Name:
Leucyl-cystinyl aminopeptidase
Synonyms:
Cystinyl aminopeptidase Insulin-regulated membrane aminopeptidase Irap Leucyl-cystinyl aminopeptidase Otase P-LAP Vesicle protein of 165 kDa | Vp165
Type:
PROTEIN
Mol. Mass.:
117179.39
Organism:
Rattus norvegicus
Description:
ChEMBL_98523
Residue:
1025
  
Inhibitor
Name:
BDBM284940
Synonyms:
US10023583, Example 12
Type:
Small organic molecule
Emp. Form.:
C21H28N2O4S
Mol. Mass.:
404.523
SMILES:
N[C@@H](CSC1CCC1)[C@](O)(Cc1nccc2oc(CCC3CC3)cc12)C(O)=O
: