Target
Mitogen-activated protein kinase 14
Ligand
BDBM50352582
Substrate
Meas. Tech.
Inhibition Assay
pH
7.5±n/a
Temperature
298.15±n/a K
IC50
72±n/a nM
Citation
 Eastwood, PRGonzalez Rodriguez, JVidal Juan, BAguilar Izquierdo, N Substituted spiro[cycloalkyl-1,3′-indo]-2′(1′H)-one derivatives and their use as P38 mitogen-activated kinase inhibitors US Patent  US8772288 Publication Date 7/8/2014 
Target
Name:
Mitogen-activated protein kinase 14
Synonyms:
CSAID-binding protein CSBP1 CSPB1 MAP kinase 14 MAP kinase p38 alpha MAPK14 MK14_HUMAN Mitogen-activated protein kinase p38 alpha Stress-activated protein kinase 2a | p38 MAP kinase alpha/beta
Type:
Serine/threonine-protein kinase
Mol. Mass.:
41286.76
Organism:
Homo sapiens (Human)
Description:
Q16539
Residue:
360
  
Inhibitor
Name:
BDBM50352582
Synonyms:
CHEMBL1825162 | US8772288, 52
Type:
Small organic molecule
Emp. Form.:
C21H22N4O2
Mol. Mass.:
362.425
SMILES:
Cc1ccc(cc1-c1ncc2c(NC(=O)C22CCCC2)n1)C(=O)NC1CC1
: