Target
Mitogen-activated protein kinase 14
Ligand
BDBM50355998
Substrate
Meas. Tech.
Inhibition Assay
pH
7.5±n/a
Temperature
298.15±n/a K
IC50
4.7±n/a nM
Citation
 Eastwood, PRGonzalez Rodriguez, JVidal Juan, BAguilar Izquierdo, N Substituted spiro[cycloalkyl-1,3′-indo]-2′(1′H)-one derivatives and their use as P38 mitogen-activated kinase inhibitors US Patent  US8772288 Publication Date 7/8/2014 
Target
Name:
Mitogen-activated protein kinase 14
Synonyms:
CSAID-binding protein CSBP1 CSPB1 MAP kinase 14 MAP kinase p38 alpha MAPK14 MK14_HUMAN Mitogen-activated protein kinase p38 alpha Stress-activated protein kinase 2a | p38 MAP kinase alpha/beta
Type:
Serine/threonine-protein kinase
Mol. Mass.:
41286.76
Organism:
Homo sapiens (Human)
Description:
Q16539
Residue:
360
  
Inhibitor
Name:
BDBM50355998
Synonyms:
CHEMBL1911333 | US8772288, 67
Type:
Small organic molecule
Emp. Form.:
C23H25N5O3S
Mol. Mass.:
451.541
SMILES:
Cc1nnc([nH]1)-c1ccc(C)c(c1)-c1ccc2c(NC(=O)C22CCN(CC2)S(C)(=O)=O)c1
: