Target
Cyclin-T1
Ligand
BDBM126501
Substrate
Meas. Tech.
IMAP Assay
IC50
0.001±n/a nM
Citation
 Barsanti, PAHu, CJin, JKeyes, RKucejko, RLin, XPan, YPfister, KBSendzik, MSutton, JWan, L Heteroaryl compounds and their uses US Patent  US8778951 Publication Date 7/15/2014 
Target
Name:
Cyclin-T1
Synonyms:
CCNT1 CycT Cyclin T Cyclin-T
Type:
Enzyme Subunit
Mol. Mass.:
80712.40
Organism:
Homo sapiens (Human)
Description:
Residue:
726
  
Inhibitor
Name:
BDBM126501
Synonyms:
US8778951, 311
Type:
Small organic molecule
Emp. Form.:
C23H32ClN5O
Mol. Mass.:
429.986
SMILES:
CC1(CNc2cccc(n2)-c2cc(N[C@H]3CC[C@H](N)CC3)ncc2Cl)CCOCC1
: