Target
Cyclin-T1
Ligand
BDBM126512
Substrate
Meas. Tech.
IMAP Assay
IC50
0.001±n/a nM
Citation
 Barsanti, PAHu, CJin, JKeyes, RKucejko, RLin, XPan, YPfister, KBSendzik, MSutton, JWan, L Heteroaryl compounds and their uses US Patent  US8778951 Publication Date 7/15/2014 
Target
Name:
Cyclin-T1
Synonyms:
CCNT1 CycT Cyclin T Cyclin-T
Type:
Enzyme Subunit
Mol. Mass.:
80712.40
Organism:
Homo sapiens (Human)
Description:
Residue:
726
  
Inhibitor
Name:
BDBM126512
Synonyms:
US8778951, 323
Type:
Small organic molecule
Emp. Form.:
C26H37Cl2N5O2
Mol. Mass.:
522.51
SMILES:
COC[C@@H](C)N[C@H]1CC[C@@H](CC1)Nc1cc(c(Cl)cn1)-c1nc(NC[C@@H]2CCCOC2)ccc1Cl
: