Target
Cyclin-T1
Ligand
BDBM126524
Substrate
Meas. Tech.
IMAP Assay
IC50
0.00027±n/a nM
Citation
 Barsanti, PAHu, CJin, JKeyes, RKucejko, RLin, XPan, YPfister, KBSendzik, MSutton, JWan, L Heteroaryl compounds and their uses US Patent  US8778951 Publication Date 7/15/2014 
Target
Name:
Cyclin-T1
Synonyms:
CCNT1 CycT Cyclin T Cyclin-T
Type:
Enzyme Subunit
Mol. Mass.:
80712.40
Organism:
Homo sapiens (Human)
Description:
Residue:
726
  
Inhibitor
Name:
BDBM126524
Synonyms:
US8778951, 335
Type:
Small organic molecule
Emp. Form.:
C27H34ClFN6O3
Mol. Mass.:
545.049
SMILES:
CC1(N[C@H]2CC[C@@H](CC2)Nc2cc(c(Cl)cn2)-c2ccc(F)c(NCC3(CCOCC3)C#N)n2)OCCO1
: