Target
Gag-Pol polyprotein
Ligand
BDBM126634
Substrate
Meas. Tech.
Alphascreen Assay
pH
7.4±n/a
Temperature
277.15±n/a K
IC50
620±n/a nM
Citation
 Bardiot, DChaltin, PChrist, FDebyser, ZDe Maeyer, MMarchand, AMarchand, DVoet, A Thieno [2, 3-B] pyridine derivatives as viral replication inhibitors US Patent  US8785638 Publication Date 7/22/2014 
Target
Name:
Gag-Pol polyprotein
Synonyms:
Gag-Pol polyprotein Protease | gag-pol
Type:
Protein
Mol. Mass.:
163312.58
Organism:
Human immunodeficiency virus type 1 (HIV-1)
Description:
P03367
Residue:
1447
  
Inhibitor
Name:
BDBM126634
Synonyms:
US8785638, 116
Type:
Small organic molecule
Emp. Form.:
C23H22F3NO2S
Mol. Mass.:
433.486
SMILES:
CCCC(C(O)=O)c1c(C)nc2sc3CCCc3c2c1-c1ccc(cc1)C(F)(F)F
: