Target
5-hydroxytryptamine receptor 1A
Ligand
BDBM126709
Substrate
Meas. Tech.
Receptor Binding Assay
Temperature
298.15±n/a K
Ki
2.5±n/a nM
Comments
extracted
Citation
 Toyoda, TNishida, TYoshinaga, H Benzyl piperidine compound US Patent  US8778970 Publication Date 7/15/2014 
Target
Name:
5-hydroxytryptamine receptor 1A
Synonyms:
5-HT-1A 5-hydroxytryptamine receptor 1A (5-HT-1A) ADRB2RL1 Dopamine D2 receptor and serotonin 1a receptor HTR1A | Serotonin receptor 1A
Type:
Mol. Mass.:
46122.49
Organism:
Homo sapiens (Human)
Description:
Residue:
422
  
Inhibitor
Name:
BDBM126709
Synonyms:
US8778970, 5-14
Type:
Small organic molecule
Emp. Form.:
C26H30BrNO5
Mol. Mass.:
516.424
SMILES:
COCCOc1cc(CC2CCN(CCc3ccc4occ(O)c(=O)c4c3)CC2)ccc1Br
: