Target
Fatty-acid amide hydrolase 1
Ligand
BDBM143257
Substrate
Meas. Tech.
FAAH Assay
pH
7.4±n/a
Temperature
298.15±n/a K
IC50
2.00±n/a nM
Comments
extracted
Citation
 Kharul, RBhuniya, DMookhtiar, KASingh, UHazare, APatil, SDatrange, LThakkar, M Amide compounds, compositions and applications thereof US Patent  US9682953 Publication Date 6/20/2017 
Target
Name:
Fatty-acid amide hydrolase 1
Synonyms:
Anandamide amidohydrolase FAAH FAAH1_HUMAN Fatty-acid amide hydrolase (FAAH) Oleamide hydrolase 1
Type:
Protein
Mol. Mass.:
63071.19
Organism:
Homo sapiens (Human)
Description:
O00519
Residue:
579
  
Inhibitor
Name:
BDBM143257
Synonyms:
US9682953, 2.B-4
Type:
Small organic molecule
Emp. Form.:
C28H24F3N5O2
Mol. Mass.:
519.5177
SMILES:
FC(F)(F)c1ccc(Oc2cccc(C=C3CCC(CC3)NC(=O)c3ccc(nc3)-c3cc[nH]n3)c2)nc1
: