Target
Focal adhesion kinase 1
Ligand
BDBM126898
Substrate
Meas. Tech.
DELFIA Assay
pH
7.5±n/a
IC50
39±n/a nM
Citation
 Stadtmueller, HBetzemeier, BSapountzis, I Pyrimidine derivatives that inhibit FAK/PTK2 US Patent  US8785464 Publication Date 7/22/2014 
Target
Name:
Focal adhesion kinase 1
Synonyms:
FADK 1 FAK1 FLT4 Focal adhesion kinase (FAK) Focal adhesion kinase 1 (FAK) Focal adhesion kinase-related nonkinase PTK2 Protein-tyrosine kinase 2 p125FAK | pp125FAK
Type:
Tyrosine-protein kinase
Mol. Mass.:
119233.17
Organism:
Homo sapiens (Human)
Description:
Q05397
Residue:
1052
  
Inhibitor
Name:
BDBM126898
Synonyms:
US8785464, 57
Type:
Small organic molecule
Emp. Form.:
C25H31F3N6O4
Mol. Mass.:
536.5466
SMILES:
COc1cc(ccc1Nc1ncc(c(OCCN2CCCC2=O)n1)C(F)(F)F)C(=O)NC1CCN(C)CC1
: