Target
Focal adhesion kinase 1
Ligand
BDBM126922
Substrate
Meas. Tech.
DELFIA Assay
pH
7.5±n/a
IC50
4±n/a nM
Citation
 Stadtmueller, HBetzemeier, BSapountzis, I Pyrimidine derivatives that inhibit FAK/PTK2 US Patent  US8785464 Publication Date 7/22/2014 
Target
Name:
Focal adhesion kinase 1
Synonyms:
FADK 1 FAK1 FLT4 Focal adhesion kinase (FAK) Focal adhesion kinase 1 (FAK) Focal adhesion kinase-related nonkinase PTK2 Protein-tyrosine kinase 2 p125FAK | pp125FAK
Type:
Tyrosine-protein kinase
Mol. Mass.:
119233.17
Organism:
Homo sapiens (Human)
Description:
Q05397
Residue:
1052
  
Inhibitor
Name:
BDBM126922
Synonyms:
US8785464, 81
Type:
Small organic molecule
Emp. Form.:
C26H28F4N6O5S
Mol. Mass.:
612.596
SMILES:
COc1cc(ccc1Nc1ncc(c(Oc2cc(F)ccc2NS(C)(=O)=O)n1)C(F)(F)F)C(=O)NC1CCN(C)CC1
: