Target
Serine/threonine-protein kinase B-raf
Ligand
BDBM127084
Substrate
Meas. Tech.
Kinase Assay
IC50
11.1±n/a nM
Citation
 Huang, JLiao, CChen, P Quinazoline compounds as kinase inhibitors US Patent  US8785459 Publication Date 7/22/2014 
Target
Name:
Serine/threonine-protein kinase B-raf
Synonyms:
B-RAF B-Raf proto-oncogene serine/threonine-protein kinase BRAF1 RAFB1 v-Raf murine sarcoma viral oncogene homolog B1
Type:
Serine/threonine-protein kinase
Mol. Mass.:
84446.00
Organism:
Homo sapiens (Human)
Description:
P15056
Residue:
766
  
Inhibitor
Name:
BDBM127084
Synonyms:
US8785459, 159
Type:
Small organic molecule
Emp. Form.:
C21H15ClFN3O3
Mol. Mass.:
411.814
SMILES:
COc1cc(ccc1O)-c1ccc2ncnc(Nc3cc(O)c(Cl)cc3F)c2c1
: