Target
Serine/threonine-protein kinase B-raf
Ligand
BDBM127085
Substrate
Meas. Tech.
Kinase Assay
IC50
8.9±n/a nM
Citation
 Huang, JLiao, CChen, P Quinazoline compounds as kinase inhibitors US Patent  US8785459 Publication Date 7/22/2014 
Target
Name:
Serine/threonine-protein kinase B-raf
Synonyms:
B-RAF B-Raf proto-oncogene serine/threonine-protein kinase BRAF1 RAFB1 v-Raf murine sarcoma viral oncogene homolog B1
Type:
Serine/threonine-protein kinase
Mol. Mass.:
84446.00
Organism:
Homo sapiens (Human)
Description:
P15056
Residue:
766
  
Inhibitor
Name:
BDBM127085
Synonyms:
US8785459, 160
Type:
Small organic molecule
Emp. Form.:
C20H12ClF2N3O
Mol. Mass.:
383.779
SMILES:
Oc1cc(Nc2ncnc3ccc(cc23)-c2ccc(Cl)cc2)c(F)cc1F
: