Target
Transient receptor potential cation channel subfamily V member 1
Ligand
BDBM127312
Substrate
Meas. Tech.
FLIPR Assay
Ki
0.3±n/a nM
Citation
 Frank, RBahrenberg, GChristoph, TSchiene, KDe Vry, JSaunders, DPrzewosny, MSundermann, BLee, J Vanilloid receptor ligands, pharmaceutical compositions containing them, process for making them, and use thereof for treating pain and other conditions US Patent  US8791268 Publication Date 7/29/2014 
Target
Name:
Transient receptor potential cation channel subfamily V member 1
Synonyms:
Capsaicin receptor Osm-9-like TRP channel 1 TRPV1_HUMAN Transient receptor potential cation channel subfamily V member 1 (TRPV1) Transient receptor potential cation channel subfamily V member 1(TRPV1) Vanilloid VR1 Vanilloid receptor 1 Vanilloid receptor 1 (VRI/TRPV1)
Type:
Protein
Mol. Mass.:
94960.75
Organism:
Homo sapiens (Human)
Description:
Q8NER1
Residue:
839
  
Inhibitor
Name:
BDBM127312
Synonyms:
US8791268, 23
Type:
Small organic molecule
Emp. Form.:
C21H22Br2F3N3O2
Mol. Mass.:
565.221
SMILES:
CC1CCN(CC1)c1nc(ccc1CNC(=O)Cc1cc(Br)c(O)c(Br)c1)C(F)(F)F
: