Target
Mitogen-activated protein kinase 1
Ligand
BDBM127597
Substrate
Meas. Tech.
Cell-Free Kinase Assays
pH
7.5±n/a
IC50
1±n/a nM
Comments
extracted
Citation
 Gerlach, MSeipelt, IBlumenstein, LMueller, GGuenther, ESchuster, TTeifel, M Pyridopyrazines as highly selective ras-Raf-Mek-Erk signal transduction pathway inhibitors US Patent  US8791118 Publication Date 7/29/2014 
Target
Name:
Mitogen-activated protein kinase 1
Synonyms:
ERK2 Extracellular signal-regulated kinase 2 Extracellular signal-regulated kinase 2 (ERK2) MAPK 2 MK01_HUMAN Mitogen-activated protein kinase 1 (ERK-2) Mitogen-activated protein kinase 2 PRKM2 | p42-MAPK
Type:
Ser/Thr Protein Kinase
Mol. Mass.:
41392.76
Organism:
Homo sapiens (Human)
Description:
P28482
Residue:
360
  
Inhibitor
Name:
BDBM127597
Synonyms:
US8791118, 160
Type:
Small organic molecule
Emp. Form.:
C24H23N5O2
Mol. Mass.:
413.4717
SMILES:
Oc1ccc(cc1)-c1cnc2ccc(NC(=O)NCCCCc3ccccc3)nc2n1
: