Target
Mitogen-activated protein kinase 1
Ligand
BDBM127601
Substrate
Meas. Tech.
Cell-Free Kinase Assays
pH
7.5±n/a
IC50
2±n/a nM
Comments
extracted
Citation
 Gerlach, MSeipelt, IBlumenstein, LMueller, GGuenther, ESchuster, TTeifel, M Pyridopyrazines as highly selective ras-Raf-Mek-Erk signal transduction pathway inhibitors US Patent  US8791118 Publication Date 7/29/2014 
Target
Name:
Mitogen-activated protein kinase 1
Synonyms:
ERK2 Extracellular signal-regulated kinase 2 Extracellular signal-regulated kinase 2 (ERK2) MAPK 2 MK01_HUMAN Mitogen-activated protein kinase 1 (ERK-2) Mitogen-activated protein kinase 2 PRKM2 | p42-MAPK
Type:
Ser/Thr Protein Kinase
Mol. Mass.:
41392.76
Organism:
Homo sapiens (Human)
Description:
P28482
Residue:
360
  
Inhibitor
Name:
BDBM127601
Synonyms:
US8791118, 164
Type:
Small organic molecule
Emp. Form.:
C23H25N7O
Mol. Mass.:
415.4909
SMILES:
CC(CCCc1ccccc1)NC(=O)Nc1ccc2ncc(nc2n1)-c1cnn(C)c1
: