Target
High affinity nerve growth factor receptor
Ligand
BDBM127640
Substrate
Meas. Tech.
ELISA Assay
pH
7.5±n/a
IC50
0.5±n/a nM
Comments
extracted
Citation
 Allen, SAndrews, SWCondroski, KRHaas, JHuang, LJiang, YKercher, TSeo, J Substituted pyrazolo[1,5-a]pyrimidine compounds as Trk kinase inhibitors US Patent  US8791123 Publication Date 7/29/2014 
Target
Name:
High affinity nerve growth factor receptor
Synonyms:
2.7.10.1 NTRK1 NTRK1_HUMAN Neurotrophic tyrosine kinase receptor type 1 Synonyms=MTC TRK1-transforming tyrosine kinase protein TRKA GN Tropomyosin alpha-3 chain/High affinity nerve growth factor receptor Tropomyosin-related kinase A (TrkA) Tyrosine kinase receptor (Trk) Tyrosine kinase receptor A (Trk A) Tyrosine kinase receptor A (TrkA) p140-TrkA
Type:
Mol. Mass.:
87498.18
Organism:
Homo sapiens (Human)
Description:
P04629
Residue:
796
  
Inhibitor
Name:
BDBM127640
Synonyms:
US10251889, Example 13 US8791123, 13 US9796724, Example 13
Type:
Small organic molecule
Emp. Form.:
C20H19F2N5O
Mol. Mass.:
383.3946
SMILES:
Fc1ccc(F)c(c1)[C@H]1CCCN1c1ccn2ncc(C(=O)NC3CC3)c2n1
: