Target
Histone deacetylase 1
Ligand
BDBM50105693
Substrate
Meas. Tech.
Inhibition of Histone Deacetylase Enzymatic Assay
Temperature
310.15±n/a K
IC50
800±n/a nM
Comments
extracted
Citation
 Déziel, RAjamian, A Inhibitors of histone deacetylase and prodrugs thereof US Patent  US8796330 Publication Date 8/5/2014 
Target
Name:
Histone deacetylase 1
Synonyms:
Cereblon/Histone deacetylase 1 HDAC1 Histone deacetylase 1 (HDAC1) RPD3L1
Type:
Enzyme
Mol. Mass.:
55090.27
Organism:
Homo sapiens (Human)
Description:
Q13547
Residue:
482
  
Inhibitor
Name:
BDBM50105693
Synonyms:
(E)-N-Hydroxy-3-[4-(4-sulfamoyl-benzenesulfonylamino)-phenyl]-acrylamide US8796330, 102
Type:
Small organic molecule
Emp. Form.:
C15H15N3O6S2
Mol. Mass.:
397.426
SMILES:
NS(=O)(=O)c1ccc(cc1)S(=O)(=O)Nc1ccc(\C=C\C(=O)NO)cc1
: