Target
Histone deacetylase 1
Ligand
BDBM128085
Substrate
Meas. Tech.
Inhibition of Histone Deacetylase Enzymatic Assay
Temperature
310.15±n/a K
IC50
1000±n/a nM
Comments
extracted
Citation
 Déziel, RAjamian, A Inhibitors of histone deacetylase and prodrugs thereof US Patent  US8796330 Publication Date 8/5/2014 
Target
Name:
Histone deacetylase 1
Synonyms:
Cereblon/Histone deacetylase 1 HDAC1 Histone deacetylase 1 (HDAC1) RPD3L1
Type:
Enzyme
Mol. Mass.:
55090.27
Organism:
Homo sapiens (Human)
Description:
Q13547
Residue:
482
  
Inhibitor
Name:
BDBM128085
Synonyms:
US8796330, 150
Type:
Small organic molecule
Emp. Form.:
C15H15NO2
Mol. Mass.:
241.2851
SMILES:
ONC(=O)c1ccc(CCc2ccccc2)cc1
: