Target
RNA-editing ligase 1, mitochondrial
Ligand
BDBM52318
Substrate
Meas. Tech.
Fluorescence-based biochemical high throughput dose response assay to identify inhibitors of Trypanosoma brucei RNA editing ligase 1 (TbREL1).
IC50
35840±n/a nM
Citation
 PubChem, PC Fluorescence-based biochemical high throughput dose response assay to identify inhibitors of Trypanosoma brucei RNA editing ligase 1 (TbREL1). PubChem Bioassay (2014)[AID] 
Target
Name:
RNA-editing ligase 1, mitochondrial
Synonyms:
REL1 Trypanosoma brucei RNA editing ligase 1
Type:
Enzyme Catalytic Domain
Mol. Mass.:
52299.36
Organism:
Trypanosoma brucei brucei
Description:
gi_342179211
Residue:
469
  
Inhibitor
Name:
BDBM52318
Synonyms:
1-[5-(3,4-dichlorophenyl)-2-furanyl]-6,7-dimethoxy-3,4-dihydroisoquinoline 1-[5-(3,4-dichlorophenyl)furan-2-yl]-6,7-dimethoxy-3,4-dihydroisoquinoline SMR000143939 | cid_1527239
Type:
Small organic molecule
Emp. Form.:
C21H17Cl2NO3
Mol. Mass.:
402.271
SMILES:
COc1cc2CCN=C(c3ccc(o3)-c3ccc(Cl)c(Cl)c3)c2cc1OC
: