Target
RNA-editing ligase 1, mitochondrial
Ligand
BDBM46591
Substrate
Meas. Tech.
Fluorescence-based biochemical high throughput dose response assay to identify inhibitors of Trypanosoma brucei RNA editing ligase 1 (TbREL1).
IC50
22931±n/a nM
Citation
 PubChem, PC Fluorescence-based biochemical high throughput dose response assay to identify inhibitors of Trypanosoma brucei RNA editing ligase 1 (TbREL1). PubChem Bioassay (2014)[AID] 
Target
Name:
RNA-editing ligase 1, mitochondrial
Synonyms:
REL1 Trypanosoma brucei RNA editing ligase 1
Type:
Enzyme Catalytic Domain
Mol. Mass.:
52299.36
Organism:
Trypanosoma brucei brucei
Description:
gi_342179211
Residue:
469
  
Inhibitor
Name:
BDBM46591
Synonyms:
2-chloranyl-4-[5-[(Z)-2-[(5-methyl-1H-1,2,4-triazol-3-yl)sulfanyl]-3-oxidanyl-3-oxidanylidene-prop-1-enyl]furan-2-yl]benzoic acid 4-[5-[(Z)-2-carboxy-2-[(5-methyl-1H-1,2,4-triazol-3-yl)thio]ethenyl]-2-furanyl]-2-chlorobenzoic acid 4-{5-[(Z)-2-Carboxy-2-(5-methyl-4H-[1,2,4]triazol-3-ylsulfanyl)-vinyl]-furan-2-yl}-2-chloro-benzoic acid SMR000415298 | cid_1625680
Type:
Small organic molecule
Emp. Form.:
C17H12ClN3O5S
Mol. Mass.:
405.812
SMILES:
Cc1nnc(SC(=Cc2ccc(o2)-c2ccc(C(O)=O)c(Cl)c2)C(O)=O)[nH]1
: