Target
RNA-editing ligase 1, mitochondrial
Ligand
BDBM51911
Substrate
Meas. Tech.
Fluorescence-based biochemical high throughput dose response assay to identify inhibitors of Trypanosoma brucei RNA editing ligase 1 (TbREL1).
IC50
>96559±n/a nM
Citation
 PubChem, PC Fluorescence-based biochemical high throughput dose response assay to identify inhibitors of Trypanosoma brucei RNA editing ligase 1 (TbREL1). PubChem Bioassay (2014)[AID] 
Target
Name:
RNA-editing ligase 1, mitochondrial
Synonyms:
REL1 Trypanosoma brucei RNA editing ligase 1
Type:
Enzyme Catalytic Domain
Mol. Mass.:
52299.36
Organism:
Trypanosoma brucei brucei
Description:
gi_342179211
Residue:
469
  
Inhibitor
Name:
BDBM51911
Synonyms:
(4-isopropoxybenzyl)-[3-(2-methoxyphenyl)-3-(4-methoxyphenyl)propyl]amine 3-(2-methoxyphenyl)-3-(4-methoxyphenyl)-N-[(4-propan-2-yloxyphenyl)methyl]propan-1-amine SMR000539687 | cid_3730081
Type:
Small organic molecule
Emp. Form.:
C27H33NO3
Mol. Mass.:
419.5558
SMILES:
COc1ccc(cc1)C(CCNCc1ccc(OC(C)C)cc1)c1ccccc1OC
: