Target
RNA-editing ligase 1, mitochondrial
Ligand
BDBM128142
Substrate
Meas. Tech.
Fluorescence-based biochemical high throughput dose response assay to identify inhibitors of Trypanosoma brucei RNA editing ligase 1 (TbREL1).
IC50
>96559±n/a nM
Citation
 PubChem, PC Fluorescence-based biochemical high throughput dose response assay to identify inhibitors of Trypanosoma brucei RNA editing ligase 1 (TbREL1). PubChem Bioassay (2014)[AID] 
Target
Name:
RNA-editing ligase 1, mitochondrial
Synonyms:
REL1 Trypanosoma brucei RNA editing ligase 1
Type:
Enzyme Catalytic Domain
Mol. Mass.:
52299.36
Organism:
Trypanosoma brucei brucei
Description:
gi_342179211
Residue:
469
  
Inhibitor
Name:
BDBM128142
Synonyms:
1-(nonoxymethyl)-3-(phenylmethyl)benzimidazol-3-ium;chloride MLS001242852 cid_10692407
Type:
Small organic molecule
Emp. Form.:
C24H33ClN2O
Mol. Mass.:
400.985
SMILES:
[Cl-].CCCCCCCCCOCn1c[n+](Cc2ccccc2)c2ccccc12
: