Target
RNA-editing ligase 1, mitochondrial
Ligand
BDBM38573
Substrate
Meas. Tech.
Fluorescence-based biochemical high throughput dose response assay to identify inhibitors of Trypanosoma brucei RNA editing ligase 1 (TbREL1).
IC50
14741±n/a nM
Citation
 PubChem, PC Fluorescence-based biochemical high throughput dose response assay to identify inhibitors of Trypanosoma brucei RNA editing ligase 1 (TbREL1). PubChem Bioassay (2014)[AID] 
Target
Name:
RNA-editing ligase 1, mitochondrial
Synonyms:
REL1 Trypanosoma brucei RNA editing ligase 1
Type:
Enzyme Catalytic Domain
Mol. Mass.:
52299.36
Organism:
Trypanosoma brucei brucei
Description:
gi_342179211
Residue:
469
  
Inhibitor
Name:
BDBM38573
Synonyms:
9,10-dimethoxy-2-(2-pyridinylmethylamino)-6,7-dihydropyrimido[6,1-a]isoquinolin-4-one 9,10-dimethoxy-2-(pyridin-2-ylmethylamino)-6,7-dihydropyrimido[6,1-a]isoquinolin-4-one SMR000046352 | cid_665278
Type:
Small organic molecule
Emp. Form.:
C20H20N4O3
Mol. Mass.:
364.3978
SMILES:
COc1cc2CCn3c(cc(NCc4ccccn4)nc3=O)-c2cc1OC
: