Target
RNA-editing ligase 1, mitochondrial
Ligand
BDBM91519
Substrate
Meas. Tech.
Fluorescence-based biochemical high throughput dose response assay to identify inhibitors of Trypanosoma brucei RNA editing ligase 1 (TbREL1).
IC50
28287±n/a nM
Citation
 PubChem, PC Fluorescence-based biochemical high throughput dose response assay to identify inhibitors of Trypanosoma brucei RNA editing ligase 1 (TbREL1). PubChem Bioassay (2014)[AID] 
Target
Name:
RNA-editing ligase 1, mitochondrial
Synonyms:
REL1 Trypanosoma brucei RNA editing ligase 1
Type:
Enzyme Catalytic Domain
Mol. Mass.:
52299.36
Organism:
Trypanosoma brucei brucei
Description:
gi_342179211
Residue:
469
  
Inhibitor
Name:
BDBM91519
Synonyms:
2-chloranyl-6-methoxy-quinoline-5,8-dione 2-chloro-6-methoxyquinoline-5,8-dione SMR001875222 | cid_341543
Type:
Small organic molecule
Emp. Form.:
C10H6ClNO3
Mol. Mass.:
223.613
SMILES:
COC1=CC(=O)c2nc(Cl)ccc2C1=O
: