Target
RNA-editing ligase 1, mitochondrial
Ligand
BDBM128186
Substrate
Meas. Tech.
Fluorescence-based biochemical high throughput dose response assay to identify inhibitors of Trypanosoma brucei RNA editing ligase 1 (TbREL1).
IC50
>96559±n/a nM
Citation
 PubChem, PC Fluorescence-based biochemical high throughput dose response assay to identify inhibitors of Trypanosoma brucei RNA editing ligase 1 (TbREL1). PubChem Bioassay (2014)[AID] 
Target
Name:
RNA-editing ligase 1, mitochondrial
Synonyms:
REL1 Trypanosoma brucei RNA editing ligase 1
Type:
Enzyme Catalytic Domain
Mol. Mass.:
52299.36
Organism:
Trypanosoma brucei brucei
Description:
gi_342179211
Residue:
469
  
Inhibitor
Name:
BDBM128186
Synonyms:
2-(1,3-benzodioxol-5-ylmethylamino)-4-(3-fluorophenyl)-6-methyl-1-[[2-(trifluoromethyl)phenyl]methyl]-4H-pyrimidine-5-carboxylic acid methyl ester MLS003843363 cid_53316178 | methyl 2-(1,3-benzodioxol-5-ylmethylamino)-4-(3-fluorophenyl)-6-methyl-1-[[2-(trifluoromethyl)phenyl]methyl]-4H-pyrimidine-5-carboxylate
Type:
Small organic molecule
Emp. Form.:
C29H25F4N3O4
Mol. Mass.:
555.5201
SMILES:
COC(=O)C1=C(C)N(Cc2ccccc2C(F)(F)F)C(NCc2ccc3OCOc3c2)=NC1c1cccc(F)c1
: