Target
Transthyretin
Ligand
BDBM74979
Substrate
Meas. Tech.
Counterscreen for activators of Transthyretin (TTR) transcription: Luminescence-based cell-based high throughput dose response assay to identify inhibitors of Transthyretin (TTR) transcription in HuH7
IC50
54855±n/a nM
Citation
 PubChem, PC Counterscreen for activators of Transthyretin (TTR) transcription: Luminescence-based cell-based high throughput dose response assay to identify inhibitors of Transthyretin (TTR) transcription in HuH7 hepatoma cells PubChem Bioassay (2014)[AID] 
Target
Name:
Transthyretin
Synonyms:
ATTR Prealbumin TTHY_HUMAN Transthyretin (TTR)
Type:
Enzyme
Mol. Mass.:
15884.31
Organism:
Homo sapiens (Human)
Description:
P02766
Residue:
147
  
Inhibitor
Name:
BDBM74979
Synonyms:
2-(9-acridinylamino)ethanol MLS000712174 cid_145758
Type:
Small organic molecule
Emp. Form.:
C15H14N2O
Mol. Mass.:
238.2845
SMILES:
OCCNc1c2ccccc2nc2ccccc12
: