Target
Transthyretin
Ligand
BDBM128229
Substrate
Meas. Tech.
Counterscreen for activators of Transthyretin (TTR) transcription: Luminescence-based cell-based high throughput dose response assay to identify inhibitors of Transthyretin (TTR) transcription in HuH7
IC50
>167158±n/a nM
Citation
 PubChem, PC Counterscreen for activators of Transthyretin (TTR) transcription: Luminescence-based cell-based high throughput dose response assay to identify inhibitors of Transthyretin (TTR) transcription in HuH7 hepatoma cells PubChem Bioassay (2014)[AID] 
Target
Name:
Transthyretin
Synonyms:
ATTR Prealbumin TTHY_HUMAN Transthyretin (TTR)
Type:
Enzyme
Mol. Mass.:
15884.31
Organism:
Homo sapiens (Human)
Description:
P02766
Residue:
147
  
Inhibitor
Name:
BDBM128229
Synonyms:
MLS000772677 N-(2-methylpropyl)-2-([1,2,4]triazolo[4,3-a]pyridin-3-ylsulfanyl)ethanamide N-isobutyl-2-([1,2,4]triazolo[4,3-a]pyridin-3-ylthio)acetamide cid_4882475
Type:
Small organic molecule
Emp. Form.:
C12H16N4OS
Mol. Mass.:
264.347
SMILES:
CC(C)CNC(=O)CSc1nnc2ccccn12
: