Target
Mitogen-activated protein kinase kinase kinase 5
Ligand
BDBM128401
Substrate
Meas. Tech.
Scintillation Assay
pH
7.5±n/a
Temperature
298.15±n/a K
IC50
69±n/a nM
Comments
extracted
Citation
 Chang, E Apoptosis signal-regulating kinase 1 inhibitors US Patent  US8802695 Publication Date 8/12/2014 
Target
Name:
Mitogen-activated protein kinase kinase kinase 5
Synonyms:
ASK1 MAP3K5 MEKK5
Type:
Protein
Mol. Mass.:
154514.93
Organism:
Homo sapiens (Human)
Description:
Q99683
Residue:
1374
  
Inhibitor
Name:
BDBM128401
Synonyms:
US8802695, 17
Type:
Small organic molecule
Emp. Form.:
C20H21N3O3
Mol. Mass.:
351.399
SMILES:
C[C@](O)(CO)c1ccc(cc1)C(=O)Nc1cc2n(ccc2cn1)C1CC1
: