Target
Gag-Pol polyprotein
Ligand
BDBM128418
Substrate
Meas. Tech.
Enzyme Inhibition Assay
Ki
0.035±n/a nM
Citation
 Ghosh, AKMartyr, CD Processes and intermediates for preparing substituted hexahydrofuro [2,3-b] furans US Patent  US8802724 Publication Date 8/12/2014 
Target
Name:
Gag-Pol polyprotein
Synonyms:
Gag-Pol polyprotein Protease | gag-pol
Type:
Protein
Mol. Mass.:
163312.58
Organism:
Human immunodeficiency virus type 1 (HIV-1)
Description:
P03367
Residue:
1447
  
Inhibitor
Name:
BDBM128418
Synonyms:
US8802724, 23a | US8802724, 23c
Type:
Small organic molecule
Emp. Form.:
C29H40N2O9S
Mol. Mass.:
592.701
SMILES:
COC1COC2OCC(OC(=O)NC(Cc3ccccc3)C(O)CN(CC(C)C)S(=O)(=O)c3ccc(OC)cc3)C12
: