Target
Fibroblast growth factor receptor 3
Ligand
BDBM128428
Substrate
Meas. Tech.
In Vitro Kinase Inhibition Assay
pH
8±n/a
Temperature
298.15±n/a K
IC50
0.55±n/a nM
Comments
extracted
Citation
 Berdini, VCarr, MGCongreve, MSFrederickson, MGriffiths-Jones, CMHamlett, CCMadin, AMurray, CWBenning, RKSaxty, GVickerstaffe, EWilliams, BJWoodhead, AJWoodhead, SJFreyne, EJGovaerts, TCAngibaud, PR Imidazopyridine derivatives as inhibitors of receptor tyrosine kinases US Patent  US8796244 Publication Date 8/5/2014 
Target
Name:
Fibroblast growth factor receptor 3
Synonyms:
CD_antigen: CD333 FGFR3 Fibroblast growth factor receptor JTK4
Type:
Protein
Mol. Mass.:
87699.57
Organism:
Homo sapiens (Human)
Description:
P22607
Residue:
806
  
Inhibitor
Name:
BDBM128428
Synonyms:
US8796244, 7
Type:
Small organic molecule
Emp. Form.:
C25H24F3N7O
Mol. Mass.:
495.4996
SMILES:
FC(F)(F)CNC(=O)Nc1cccc(c1)-c1cnc2cc(ccn12)-c1ccc(nn1)N1CCCCC1
: