Target
Fibroblast growth factor receptor 3
Ligand
BDBM128668
Substrate
Meas. Tech.
In Vitro Kinase Inhibition Assay
pH
8±n/a
Temperature
298.15±n/a K
IC50
0.54±n/a nM
Comments
extracted
Citation
 Berdini, VCarr, MGCongreve, MSFrederickson, MGriffiths-Jones, CMHamlett, CCMadin, AMurray, CWBenning, RKSaxty, GVickerstaffe, EWilliams, BJWoodhead, AJWoodhead, SJFreyne, EJGovaerts, TCAngibaud, PR Imidazopyridine derivatives as inhibitors of receptor tyrosine kinases US Patent  US8796244 Publication Date 8/5/2014 
Target
Name:
Fibroblast growth factor receptor 3
Synonyms:
CD_antigen: CD333 FGFR3 Fibroblast growth factor receptor JTK4
Type:
Protein
Mol. Mass.:
87699.57
Organism:
Homo sapiens (Human)
Description:
P22607
Residue:
806
  
Inhibitor
Name:
BDBM128668
Synonyms:
US8796244, 261
Type:
Small organic molecule
Emp. Form.:
C18H14F3N7OS
Mol. Mass.:
433.41
SMILES:
Nc1nnc(s1)-c1ccn2c(cnc2c1)-c1cccc(NC(=O)NCC(F)(F)F)c1
: