Target
DNA-dependent protein kinase catalytic subunit
Ligand
BDBM128790
Substrate
Meas. Tech.
Biochemical Assay
pH
7.4±n/a
Temperature
298.15±n/a K
IC50
0.3±n/a nM
Comments
extracted
Citation
 Fuchss, TMederski, WZenke, F Pyrazoloquinolines US Patent  US8802712 Publication Date 8/12/2014 
Target
Name:
DNA-dependent protein kinase catalytic subunit
Synonyms:
DNA-PK catalytic subunit DNA-dependent protein kinase (DNA-PK) DNA-dependent protein kinase catalytic subunit (DNA-PK) HYRC PRKDC | PRKDC_HUMAN
Type:
Protein
Mol. Mass.:
469114.78
Organism:
Homo sapiens (Human)
Description:
P78527
Residue:
4128
  
Inhibitor
Name:
BDBM128790
Synonyms:
US8802712, 48
Type:
Small organic molecule
Emp. Form.:
C35H36FN7O3
Mol. Mass.:
621.7038
SMILES:
CCN1CCN(CCNC(=O)C(Oc2cc3c4c(nn(C)c4cnc3cc2OC)-c2ccc(cc2)C#N)c2ccc(F)cc2)CC1
: