Target
Membrane primary amine oxidase
Ligand
BDBM129002
Substrate
Meas. Tech.
Inhibition Assay
Temperature
298.15±n/a K
IC50
72±n/a nM
Comments
extracted
Citation
 Yoshihara, KSuzuki, DYamaki, SKoga, YSeki, NFujiyasu, JNeya, M Glycine compound US Patent  US8802679 Publication Date 8/12/2014 
Target
Name:
Membrane primary amine oxidase
Synonyms:
AOC3 Amine oxidase, copper containing Semicarbazide-sensitive amine oxidase/ Vascular adhesion protein 1 (SSAO/VAP-1) Vascular adhesion protein 1 (VAP-1)
Type:
Protein
Mol. Mass.:
84620.86
Organism:
Homo sapiens (Human)
Description:
Q16853
Residue:
763
  
Inhibitor
Name:
BDBM129002
Synonyms:
US8802679, 147
Type:
Small organic molecule
Emp. Form.:
C23H26ClN7O
Mol. Mass.:
451.952
SMILES:
CN(Cc1cccc(c1)-c1cnc(nc1)N1CCN(CC1)c1ncccc1Cl)C(=O)CN
: