Target
Bromodomain-containing protein 4
Ligand
BDBM284957
Substrate
Meas. Tech.
In Vitro Enzyme Inhibition Assay
pH
7.3±n/a
IC50
2750±n/a nM
Comments
extracted
Citation
 Boloor, A Bromodomain inhibitors US Patent  US10023592 Publication Date 7/17/2018 
Target
Name:
Bromodomain-containing protein 4
Synonyms:
BRD4 Bromodomain-containing protein 4 (BRD4) Protein HUNK1
Type:
Protein
Mol. Mass.:
152264.84
Organism:
Homo sapiens (Human)
Description:
O60885
Residue:
1362
  
Inhibitor
Name:
BDBM284957
Synonyms:
4-(3-methoxyphenyl)-2- methylisoquinolin-1-one US10941160, Example 2
Type:
Small organic molecule
Emp. Form.:
C17H15NO2
Mol. Mass.:
265.3065
SMILES:
COc1cccc(c1)-c1cn(C)c(=O)c2ccccc12
: