Target
Bromodomain-containing protein 4
Ligand
BDBM284975
Substrate
Meas. Tech.
In Vitro Enzyme Inhibition Assay
pH
7.3±n/a
IC50
>5000±n/a nM
Comments
extracted
Citation
 Boloor, A Bromodomain inhibitors US Patent  US10023592 Publication Date 7/17/2018 
Target
Name:
Bromodomain-containing protein 4
Synonyms:
BRD4 Bromodomain-containing protein 4 (BRD4) Protein HUNK1
Type:
Protein
Mol. Mass.:
152264.84
Organism:
Homo sapiens (Human)
Description:
O60885
Residue:
1362
  
Inhibitor
Name:
BDBM284975
Synonyms:
2-methyl-4-(2-oxo-1,3-dihydroindo1-6- yl)isoquinolin-1-one US10941160, Example 20
Type:
Small organic molecule
Emp. Form.:
C18H14N2O2
Mol. Mass.:
290.316
SMILES:
Cn1cc(-c2ccc3CC(=O)Nc3c2)c2ccccc2c1=O
: