Target
Sphingosine 1-phosphate receptor 1
Ligand
BDBM129581
Substrate
Meas. Tech.
Receptor Binding Assay
pH
7.4±n/a
Temperature
277.15±n/a K
Ki
68±n/a nM
Comments
extracted
Citation
 Quattropani, ABaker-Glenn, CBlackaby, WKnight, C Pyrazole oxadiazole derivatives as S1P1 agonists US Patent  US8802663 Publication Date 8/12/2014 
Target
Name:
Sphingosine 1-phosphate receptor 1
Synonyms:
CHEDG1 Endothelial differentiation G-protein coupled receptor 1 S1P1 S1PR1_HUMAN Sphingosine 1-phosphate receptor Edg-1
Type:
Enzyme
Mol. Mass.:
42836.02
Organism:
Homo sapiens (Human)
Description:
P21453
Residue:
382
  
Inhibitor
Name:
BDBM129581
Synonyms:
US8802663, 38
Type:
Small organic molecule
Emp. Form.:
C23H21N7O
Mol. Mass.:
411.4591
SMILES:
C1CCC(CC1)n1ncc(-c2nc(no2)-c2ccc3[nH]ncc3c2)c1-c1ccncc1
: