Target
Baculoviral IAP repeat-containing protein 3 [238-349]
Ligand
BDBM7006
Substrate
Meas. Tech.
Fluorescence Polarization-Based Assays
IC50
<50±n/a nM
Citation
 Wang, SSun, H Bivalent diazo bicyclic Smac mimetics and the uses thereof US Patent  US8815927 Publication Date 8/26/2014 
Target
Name:
Baculoviral IAP repeat-containing protein 3 [238-349]
Synonyms:
API2 BIRC3 Baculoviral IAP repeat-containing protein 3 Inhibitor of apoptosis protein 1 RNF49 cIAP-2 BIR3
Type:
BIR3 domain
Mol. Mass.:
12945.93
Organism:
Homo sapiens (Human)
Description:
Human cIAP2 BIR3 domain (residues 238-349) was used in binding assays.
Residue:
112
  
Inhibitor
Name:
BDBM7006
Synonyms:
US8815927, SM-1258
Type:
Emp. Form.:
C63H83N12O6
Mol. Mass.:
1104.4099
SMILES:
CN[C@@H](C)C(=O)N[C@H]1CN(CC[C@H]2CC[C@H](N2C1=O)c1nc2c(cccc2[nH]1)-c(:c:c):c:c)C(=O)CCCCCCCCCCC(=O)N1CC[C@H]2CC[C@H](N2C(=O)[C@H](C1)NC(=O)[C@H](C)NC)c1nc2c(cccc2[nH]1)-c1ccccc1
: